{"text_format":"1","workbook":"xlsx","n_sheets":16,"sheets":["Menu","Superstrat Option List","Superstrat Padalka Calculation","Headless Option List","Headless Padalka Calculation","Strathing Option List","Earth Padalka Calculation","Telething Option List","Mars Padalka Calculation","Les Paulthing Option list","Mercury Padalka Calculation","Ennea Guitar Option list","Ennea Guitar Padalka Calculatio","Ennea Bass Option list","Exchange Rate Calculation","Ennea Bass Padalka Calculation"],"not_rendered":{"charts":0,"images":27,"macros":1,"external_links":1,"defined_names":15,"comments":0,"pivot_tables":0},"unopened":[],"bounds":{"document_bytes":16777216,"sheet_cells":100000,"rows_first":2000,"rows_last":500,"rows_between":2000,"halvings":0,"cell_chars":16384,"cell_head_chars":4096},"cells_cut":0,"cells_raw":0,"read":"whole","date_system":"1900"}

{"sheet":"Menu","index":0,"n_rows":0,"n_cols":0,"rows_kept":0,"cut":false,"hidden":false,"merged":[]}

{"sheet":"Superstrat Option List","index":1,"n_rows":294,"n_cols":7,"rows_kept":294,"cut":false,"hidden":true,"merged":[]}
["Group","Description","Options","Rate $","2nd Rate","Russian Rates"]
["General Specifications","Model","Select Option",null,null,null,"Rate with formula, only change Russian rate"]
["General Specifications","Model","Space",2000]
["General Specifications","Model","Moon",2000]
["General Specifications","Model","CS",2000]
["General Specifications","Model","MS",2000]
["General Specifications","Number of strings","Select Option"]
["General Specifications","Number of strings",6,0]
["General Specifications","Number of strings",7,65]
["General Specifications","Number of strings",8,115]
{"$rows_left_out":285}
{"sheet":"Superstrat Padalka Calculation","index":2,"n_rows":90,"n_cols":7,"rows_kept":90,"cut":false,"hidden":false,"merged":[[85,3,89,4],[10,2,10,4],[13,2,13,4],[37,2,37,4],[42,2,42,4],[55,2,55,4],[54,1,54,2],[51,1,51,2],[48,1,48,2],[28,1,28,2],[18,1,18,4],[29,2,29,4],[33,2,33,4],[19,1,19,4],[21,1,21,4],[53,2,53,4],[61,2,61,4],[59,2,59,4],[78,2,78,4],[77,2,77,4],[68,2,68,4],[72,2,72,4],[73,2,73,4],[79,2,79,4],[4,1,4,4],[74,1,74,2],[74,3,74,4],[5,3,5,4],[6,1,6,4],[14,1,14,4],[30,1,30,4],[38,1,38,4],[43,1,43,4],[56,1,56,4],[62,1,62,4],[75,2,75,4],[76,2,76,4],[64,2,64,4],[66,2,66,4],[80,1,80,4],[81,2,81,4],[82,2,82,4],[83,2,83,4],[84,2,84,4]]}
[]
[]
[]
[]
[null,"Specifications"]
["Part","Description","Choosen option","Cost"]
["General Specifications","General Specifications"]
["General Specifications","Model","Select Option",{"$f":"IFERROR(INDEX('Superstrat Option List'!D2:D1928,MATCH(A8&B8&C8,'Superstrat Option List'!A2:A1928&'Superstrat Option List'!B2:B1928&'Superstrat Option List'!C2:C1928,0)),\"Please choose option\")","v":0}]
["General Specifications","Number of Strings","Select Option",{"$f":"IFERROR(INDEX('Superstrat Option List'!D3:D1929,MATCH(A9&B9&C9,'Superstrat Option List'!A3:A1929&'Superstrat Option List'!B3:B1929&'Superstrat Option List'!C3:C1929,0)),\"Please choose option\")","v":0}]
["General Specifications","Scale Length","Select Option",{"$f":"IFERROR(INDEX('Superstrat Option List'!D4:D1930,MATCH(A10&B10&C10,'Superstrat Option List'!A4:A1930&'Superstrat Option List'!B4:B1930&'Superstrat Option List'!C4:C1930,0)),\"Please choose option\")","v":0}]
{"$rows_left_out":81}
{"sheet":"Headless Option List","index":3,"n_rows":186,"n_cols":7,"rows_kept":186,"cut":false,"hidden":true,"merged":[[144,4,147,4],[148,4,151,4]]}
["Group","Description","Options","Rate $","2nd Rate","Russian Rates"]
["General Specifications","Model","Select Option",null,null,null,"Rate with formula, only change Russian rate"]
["General Specifications","Model","Neptune",2100]
["General Specifications","Model","Saturn",2250]
["General Specifications","Number of strings","Select Option"]
["General Specifications","Number of strings",6,0]
["General Specifications","Number of strings",7,65]
["General Specifications","Number of strings",8,115]
["General Specifications","Scale length","Select Option"]
["General Specifications","Scale length","25,5\"",0]
{"$rows_left_out":177}
{"sheet":"Headless Padalka Calculation","index":4,"n_rows":61,"n_cols":6,"rows_kept":61,"cut":false,"hidden":false,"merged":[[4,1,4,4],[5,3,5,4],[58,1,58,4],[59,2,59,4],[60,2,60,4],[56,2,56,4],[57,2,57,4],[52,1,52,2],[52,3,52,4],[53,2,53,4],[54,2,54,4],[55,2,55,4],[6,1,6,4],[11,1,11,16383],[15,1,15,4],[23,1,23,16383],[29,1,29,16383],[37,1,37,16383],[43,1,43,4],[16,1,16,4],[18,1,18,4],[38,1,38,4],[40,1,40,16383]]}
[]
[]
[]
[]
[null,"Specifications"]
["Part","Description","Choosen option","Cost"]
["General Specifications","General Specifications"]
["General Specifications","Model",{"$f":"IFERROR(INDEX('Superstrat Option List'!C2:C278,MATCH(#REF!&A8&B8,'Superstrat Option List'!#REF!&'Superstrat Option List'!A2:A278&'Superstrat Option List'!B2:B278,0)),\"Select Option\")","v":"Select Option"},{"$f":"IFERROR(INDEX('Headless Option List'!D2:D2508,MATCH(A8&B8&C8,'Headless Option List'!A2:A2508&'Headless Option List'!B2:B2508&'Headless Option List'!C2:C2508,0)),\"Please choose option\")","v":0}]
["General Specifications","Number of Strings",{"$f":"IFERROR(INDEX('Superstrat Option List'!C3:C278,MATCH(#REF!&A9&B9,'Superstrat Option List'!#REF!&'Superstrat Option List'!A3:A278&'Superstrat Option List'!B3:B278,0)),\"Select Option\")","v":"Select Option"},{"$f":"IFERROR(INDEX('Headless Option List'!D3:D2509,MATCH(A9&B9&C9,'Headless Option List'!A3:A2509&'Headless Option List'!B3:B2509&'Headless Option List'!C3:C2509,0)),\"Please choose option\")","v":0}]
["General Specifications","Scale Length",{"$f":"IFERROR(INDEX('Superstrat Option List'!C4:C278,MATCH(#REF!&A10&B10,'Superstrat Option List'!#REF!&'Superstrat Option List'!A4:A278&'Superstrat Option List'!B4:B278,0)),\"Select Option\")","v":"Select Option"},{"$f":"IFERROR(INDEX('Headless Option List'!D4:D2510,MATCH(A10&B10&C10,'Headless Option List'!A4:A2510&'Headless Option List'!B4:B2510&'Headless Option List'!C4:C2510,0)),\"Please choose option\")","v":0}]
{"$rows_left_out":52}
{"sheet":"Strathing Option List","index":5,"n_rows":207,"n_cols":7,"rows_kept":207,"cut":false,"hidden":true,"merged":[]}
["Group","Description","Options","Rate $","2nd Rate","Russian Rates"]
["General Specifications","Model","Select Option",null,null,null,"Rate with formula, only change Russian rate"]
["General Specifications","Model","Earth",{"$f":"F3*'Exchange Rate Calculation'!$Q$7","v":833.33},null,50000]
["General Specifications","Number of strings","Select Option"]
["General Specifications","Number of strings",6,0]
["General Specifications","Scale length","Select Option"]
["General Specifications","Scale length","24,75\"",0]
["General Specifications","Scale length","25,5\"",0]
["General Specifications","Scale length","26\"",0]
["General Specifications","Scale length","26,5\"",0]
{"$rows_left_out":198}
{"sheet":"Earth Padalka Calculation","index":6,"n_rows":73,"n_cols":7,"rows_kept":73,"cut":false,"hidden":true,"merged":[[29,2,29,4],[33,2,33,4],[54,2,54,4],[56,2,56,4],[58,2,58,4],[63,2,63,4],[46,1,46,2],[51,2,51,4],[72,3,72,4],[62,2,62,4],[67,2,67,4],[68,2,68,4],[69,2,69,4],[64,1,64,2],[64,3,64,4],[65,2,65,4],[66,2,66,4],[70,1,70,4],[71,2,71,4],[4,1,4,4],[5,3,5,4],[6,1,6,4],[15,1,15,4],[52,1,52,4],[47,2,47,4],[48,1,48,4],[11,1,11,4],[16,1,16,4],[25,2,25,4],[26,1,26,4],[36,2,36,4],[37,1,37,4],[18,1,18,4],[34,1,34,4],[45,2,45,4]]}
[]
[]
[]
[]
[null,"Specifications"]
["Part","Description","Choosen option","Cost"]
["General Specifications","General Specifications"]
["General Specifications","Model",{"$f":"IFERROR(INDEX('Superstrat Option List'!C2:C278,MATCH(#REF!&A8&B8,'Superstrat Option List'!#REF!&'Superstrat Option List'!A2:A278&'Superstrat Option List'!B2:B278,0)),\"Select Option\")","v":"Select Option"},{"$f":"INDEX('Strathing Option List'!D2:D207,MATCH('Earth Padalka Calculation'!A8&'Earth Padalka Calculation'!B8&'Earth Padalka Calculation'!C8,'Strathing Option List'!A2:A207&'Strathing Option List'!B2:B207&'Strathing Option List'!C2:C207,0))","v":0}]
["General Specifications","Number of Strings",{"$f":"IFERROR(INDEX('Superstrat Option List'!C3:C278,MATCH(#REF!&A9&B9,'Superstrat Option List'!#REF!&'Superstrat Option List'!A3:A278&'Superstrat Option List'!B3:B278,0)),\"Select Option\")","v":"Select Option"},{"$f":"INDEX('Strathing Option List'!D3:D208,MATCH('Earth Padalka Calculation'!A9&'Earth Padalka Calculation'!B9&'Earth Padalka Calculation'!C9,'Strathing Option List'!A3:A208&'Strathing Option List'!B3:B208&'Strathing Option List'!C3:C208,0))","v":0}]
["General Specifications","Scale Length",{"$f":"IFERROR(INDEX('Superstrat Option List'!C4:C278,MATCH(#REF!&A10&B10,'Superstrat Option List'!#REF!&'Superstrat Option List'!A4:A278&'Superstrat Option List'!B4:B278,0)),\"Select Option\")","v":"Select Option"},{"$f":"INDEX('Strathing Option List'!D4:D209,MATCH('Earth Padalka Calculation'!A10&'Earth Padalka Calculation'!B10&'Earth Padalka Calculation'!C10,'Strathing Option List'!A4:A209&'Strathing Option List'!B4:B209&'Strathing Option List'!C4:C209,0))","v":0}]
{"$rows_left_out":64}
{"sheet":"Telething Option List","index":7,"n_rows":225,"n_cols":7,"rows_kept":225,"cut":false,"hidden":true,"merged":[]}
["Group","Description","Options","Rate $","2nd Rate","Russian Rates"]
["General Specifications","Model","Select Option",null,null,null,"Rate with formula, only change Russian rate"]
["General Specifications","Model","Mars-1",{"$f":"F3*'Exchange Rate Calculation'!$Q$7","v":833.33},null,50000]
["General Specifications","Model","Mars-2",{"$f":"F4*'Exchange Rate Calculation'!$Q$7","v":833.33},null,50000]
["General Specifications","Number of strings","Select Option"]
["General Specifications","Number of strings",6,0]
["General Specifications","Scale length","Select Option"]
["General Specifications","Scale length","25,5\"",0]
["General Specifications","Scale length","26\"",0]
["General Specifications","Scale length","26,5\"",0]
{"$rows_left_out":216}
{"sheet":"Mars Padalka Calculation","index":8,"n_rows":65,"n_cols":7,"rows_kept":65,"cut":false,"hidden":true,"merged":[[63,3,64,4],[4,1,4,4],[5,3,5,4],[6,1,6,4],[18,1,18,4],[23,1,23,4],[31,1,31,4],[49,2,49,4],[43,1,43,4],[11,1,11,4],[15,1,15,4],[16,1,16,4],[60,1,60,4],[53,2,53,4],[47,2,47,4],[40,1,40,4],[45,2,45,4],[29,1,29,4],[61,2,61,4],[62,2,62,4],[57,2,57,4],[58,2,58,4],[59,2,59,4],[54,1,54,2],[54,3,54,4],[55,2,55,4],[56,2,56,4]]}
[]
[]
[]
[]
[null,"Specifications"]
["Part","Description","Choosen option","Cost"]
["General Specifications","General Specifications"]
["General Specifications","Model",{"$f":"IFERROR(INDEX('Superstrat Option List'!C2:C277,MATCH(#REF!&A8&B8,'Superstrat Option List'!#REF!&'Superstrat Option List'!A2:A277&'Superstrat Option List'!B2:B277,0)),\"Select Option\")","v":"Select Option"},{"$f":"INDEX('Telething Option List'!D2:D225,MATCH('Mars Padalka Calculation'!A8&'Mars Padalka Calculation'!B8&'Mars Padalka Calculation'!C8,'Telething Option List'!A2:A225&'Telething Option List'!B2:B225&'Telething Option List'!C2:C225,0))","v":0}]
["General Specifications","Number of Strings",{"$f":"IFERROR(INDEX('Superstrat Option List'!C3:C278,MATCH(#REF!&A9&B9,'Superstrat Option List'!#REF!&'Superstrat Option List'!A3:A278&'Superstrat Option List'!B3:B278,0)),\"Select Option\")","v":"Select Option"},{"$f":"IFERROR(INDEX('Superstrat Option List'!D3:D1929,MATCH(A9&B9&C9,'Superstrat Option List'!A3:A1929&'Superstrat Option List'!B3:B1929&'Superstrat Option List'!C3:C1929,0)),\"Please choose option\")","v":0}]
["General Specifications","Scale Length",{"$f":"IFERROR(INDEX('Superstrat Option List'!C4:C279,MATCH(#REF!&A10&B10,'Superstrat Option List'!#REF!&'Superstrat Option List'!A4:A279&'Superstrat Option List'!B4:B279,0)),\"Select Option\")","v":"Select Option"},{"$f":"IFERROR(INDEX('Superstrat Option List'!D4:D1930,MATCH(A10&B10&C10,'Superstrat Option List'!A4:A1930&'Superstrat Option List'!B4:B1930&'Superstrat Option List'!C4:C1930,0)),\"Please choose option\")","v":0}]
{"$rows_left_out":56}
{"sheet":"Les Paulthing Option list","index":9,"n_rows":251,"n_cols":7,"rows_kept":251,"cut":false,"hidden":true,"merged":[]}
["Group","Description","Options","Rate $","2nd Rate","Russian Rates"]
["General Specifications","Model","Select Option",null,null,null,"Rate with formula, only change Russian rate"]
["General Specifications","Model","Mercury-1",{"$f":"F3*'Exchange Rate Calculation'!$Q$7","v":916.66300000000001},null,55000]
["General Specifications","Model","Mercury-2",{"$f":"F4*'Exchange Rate Calculation'!$Q$7","v":916.66300000000001},null,55000]
["General Specifications","Number of strings","Select Option"]
["General Specifications","Number of strings",6,0]
["General Specifications","Number of strings",7,50]
["General Specifications","Scale length","Select Option"]
["General Specifications","Scale length","24,75\"",0]
["General Specifications","Scale length","25,5\"",0]
{"$rows_left_out":242}
{"sheet":"Mercury Padalka Calculation","index":10,"n_rows":77,"n_cols":7,"rows_kept":77,"cut":false,"hidden":true,"merged":[[76,3,76,4],[26,2,26,4],[27,1,27,4],[16,1,16,4],[12,1,12,4],[70,2,70,4],[71,2,71,4],[72,2,72,4],[67,1,67,2],[67,3,67,4],[68,2,68,4],[69,2,69,4],[75,2,75,4],[19,1,19,4],[17,1,17,4],[66,2,66,4],[55,1,55,4],[57,2,57,4],[59,2,59,4],[61,2,61,4],[65,2,65,4],[4,1,4,4],[5,3,5,4],[6,1,6,4],[73,1,73,4],[74,2,74,4],[30,2,30,4],[49,1,49,2],[54,2,54,4],[39,2,39,4],[40,1,40,4],[48,2,48,4],[34,2,34,4],[35,1,35,4],[50,2,50,4],[51,1,51,4],[11,2,11,4]]}
[]
[]
[]
[]
[null,"Specifications"]
["Part","Description","Choosen option","Cost"]
["General Specifications","General Specifications"]
["General Specifications","Model",{"$f":"IFERROR(INDEX('Superstrat Option List'!C2:C278,MATCH(#REF!&A8&B8,'Superstrat Option List'!#REF!&'Superstrat Option List'!A2:A278&'Superstrat Option List'!B2:B278,0)),\"Select Option\")","v":"Select Option"},{"$f":"INDEX('Les Paulthing Option list'!D2:D251,MATCH('Mercury Padalka Calculation'!A8&'Mercury Padalka Calculation'!B8&'Mercury Padalka Calculation'!C8,'Les Paulthing Option list'!A2:A251&'Les Paulthing Option list'!B2:B251&'Les Paulthing Option list'!C2:C251,0))","v":0}]
["General Specifications","Number of Strings",{"$f":"IFERROR(INDEX('Superstrat Option List'!C3:C278,MATCH(#REF!&A9&B9,'Superstrat Option List'!#REF!&'Superstrat Option List'!A3:A278&'Superstrat Option List'!B3:B278,0)),\"Select Option\")","v":"Select Option"},{"$f":"IFERROR(INDEX('Superstrat Option List'!D3:D1929,MATCH(A9&B9&C9,'Superstrat Option List'!A3:A1929&'Superstrat Option List'!B3:B1929&'Superstrat Option List'!C3:C1929,0)),\"Please choose option\")","v":0}]
["General Specifications","Scale Length",{"$f":"IFERROR(INDEX('Superstrat Option List'!C4:C278,MATCH(#REF!&A10&B10,'Superstrat Option List'!#REF!&'Superstrat Option List'!A4:A278&'Superstrat Option List'!B4:B278,0)),\"Select Option\")","v":"Select Option"},{"$f":"IFERROR(INDEX('Superstrat Option List'!D4:D1930,MATCH(A10&B10&C10,'Superstrat Option List'!A4:A1930&'Superstrat Option List'!B4:B1930&'Superstrat Option List'!C4:C1930,0)),\"Please choose option\")","v":0}]
{"$rows_left_out":68}
{"sheet":"Ennea Guitar Option list","index":11,"n_rows":216,"n_cols":7,"rows_kept":216,"cut":false,"hidden":true,"merged":[]}
["Group","Description","Options","Rate $","2nd Rate","Russian Rate"]
["General Specifications","Model","Select Option",null,null,null,"Rate with formula, only change Russian rate"]
["General Specifications","Model","Ennea Guitar",{"$f":"F3*'Exchange Rate Calculation'!$Q$7","v":999.99599999999998},null,60000]
["General Specifications","Number of strings","Select Option"]
["General Specifications","Number of strings",6,0]
["General Specifications","Number of strings",7,50]
["General Specifications","Scale length","Select Option"]
["General Specifications","Scale length","25,5\"",0]
["General Specifications","Scale length","26\"",0]
["General Specifications","Scale length","26,5\"",0]
{"$rows_left_out":207}
{"sheet":"Ennea Guitar Padalka Calculatio","index":12,"n_rows":70,"n_cols":7,"rows_kept":70,"cut":false,"hidden":true,"merged":[[55,2,55,4],[48,2,48,4],[49,1,49,4],[69,3,69,4],[64,2,64,4],[65,2,65,4],[66,2,66,4],[61,1,61,2],[61,3,61,4],[62,2,62,4],[63,2,63,4],[67,1,67,4],[68,2,68,4],[60,2,60,4],[59,2,59,4],[51,2,51,4],[4,1,4,4],[5,3,5,4],[6,1,6,4],[37,2,37,4],[38,1,38,4],[11,1,11,4],[15,1,15,4],[16,1,16,4],[26,1,26,4],[29,2,29,4],[33,2,33,4],[34,1,34,4],[53,2,53,4],[42,2,42,4],[44,2,44,4],[45,1,45,4],[18,1,18,4],[25,2,25,4],[43,1,43,2]]}
[]
[]
[]
[]
[null,"Specifications"]
["Part","Description","Choosen option","Cost"]
["General Specifications","General Specifications"]
["General Specifications","Model",{"$f":"IFERROR(INDEX('Superstrat Option List'!C2:C278,MATCH(#REF!&A8&B8,'Superstrat Option List'!#REF!&'Superstrat Option List'!A2:A278&'Superstrat Option List'!B2:B278,0)),\"Select Option\")","v":"Select Option"},{"$f":"INDEX('Ennea Guitar Option list'!D2:D216,MATCH('Ennea Guitar Padalka Calculatio'!A8&'Ennea Guitar Padalka Calculatio'!B8&'Ennea Guitar Padalka Calculatio'!C8,'Ennea Guitar Option list'!A2:A216&'Ennea Guitar Option list'!B2:B216&'Ennea Guitar Option list'!C2:C216,0))","v":0}]
["General Specifications","Number of Strings",{"$f":"IFERROR(INDEX('Superstrat Option List'!C3:C278,MATCH(#REF!&A9&B9,'Superstrat Option List'!#REF!&'Superstrat Option List'!A3:A278&'Superstrat Option List'!B3:B278,0)),\"Select Option\")","v":"Select Option"},{"$f":"IFERROR(INDEX('Superstrat Option List'!D3:D1929,MATCH(A9&B9&C9,'Superstrat Option List'!A3:A1929&'Superstrat Option List'!B3:B1929&'Superstrat Option List'!C3:C1929,0)),\"Please choose option\")","v":0}]
["General Specifications","Scale Length",{"$f":"IFERROR(INDEX('Superstrat Option List'!C4:C278,MATCH(#REF!&A10&B10,'Superstrat Option List'!#REF!&'Superstrat Option List'!A4:A278&'Superstrat Option List'!B4:B278,0)),\"Select Option\")","v":"Select Option"},{"$f":"IFERROR(INDEX('Superstrat Option List'!D4:D1930,MATCH(A10&B10&C10,'Superstrat Option List'!A4:A1930&'Superstrat Option List'!B4:B1930&'Superstrat Option List'!C4:C1930,0)),\"Please choose option\")","v":0}]
{"$rows_left_out":61}
{"sheet":"Ennea Bass Option list","index":13,"n_rows":141,"n_cols":7,"rows_kept":141,"cut":false,"hidden":true,"merged":[]}
["Group","Description","Options","Rate $","2nd Rate $","Russian Rate"]
["General Specifications","Model","Select Option",null,null,null,"Rate with formula, only change Russian rate"]
["General Specifications","Model","Ennea Bass Doublecut",2500]
["General Specifications","Model","Ennea Bass Singlecut",2500]
["General Specifications","Number of strings","Select Option"]
["General Specifications","Number of strings",4,0]
["General Specifications","Number of strings",5,85]
["General Specifications","Number of strings",6,165]
["General Specifications","Scale length","Select Option"]
["General Specifications","Scale length","34\"",0]
{"$rows_left_out":132}
{"sheet":"Exchange Rate Calculation","index":14,"n_rows":57,"n_cols":18,"rows_kept":57,"cut":false,"hidden":true,"merged":[]}
["US Dollar","1.00 USD","inv. 1.00 USD",null,null," *Select*",null,null,null,null,null," *Select*"]
["Argentine Peso",13889853,"0.071995",null,null,{"$f":"A1","v":"US Dollar"},1,1,null,null,null,"US Dollar","USD"]
["Australian Dollar",1422464,"0.703005",null,null,{"$f":"A2","v":"Argentine Peso"},{"$f":"B2","v":13889853},{"$f":"C2","v":"0.071995"},null,null,null,"Argentine Peso","ARS"]
["Bahraini Dinar","0.377339",2650134,null,null,"Australian Dollar",1422464,"0.703005",null,null,null,"Australian Dollar","AUD",null,null,"Base Currency","Russian Ruble",{"$f":"VLOOKUP(Q4,'[1]Pivot Table'!$G$2:$H$57,2,0)","v":"RUB"}]
["Botswana Pula",11386563,"0.087823",null,null,"Bahraini Dinar","0.377339",2650134,null,null,null,"Bahraini Dinar","BHD",null,null,"Target Currency","US Dollar",{"$f":"VLOOKUP(Q5,'[1]Pivot Table'!$G$2:$H$57,2,0)","v":"USD"}]
["Brazilian Real",4044582,"0.247244",null,null,"Botswana Pula",11386563,"0.087823",null,null,null,"Botswana Pula","BWP",null,null,{"$f":"CONCATENATE(\" Exchange Rate \",VLOOKUP(Q4,L2:M57,2,0),\"/\",VLOOKUP(Q5,L2:M57,2,0))","v":" Exchange Rate RUB/USD"},{"$f":"VLOOKUP(Q4,$F$2:$H$57,3,0)","v":"0.013461"},{"$f":"R5","v":"USD"}]
["Bruneian Dollar",1436996,"0.695896",null,null,"Brazilian Real",4044582,"0.247244",null,null,null,"Brazilian Real","BRL",null,null,"1 RUB =",1.66666E-2,{"$f":"R6","v":"USD"}]
["Bulgarian Lev",1800060,"0.555537",null,null,"Bruneian Dollar",1436996,"0.695896",null,null,null,"Bruneian Dollar","BND"]
["Canadian Dollar",1410953,"0.708741",null,null,"Bulgarian Lev",1800060,"0.555537",null,null,null,"Bulgarian Lev","BGN"]
["Chilean Peso",721896567,"0.001385",null,null,"Canadian Dollar",1410953,"0.708741",null,null,null,"Canadian Dollar","CAD"]
{"$rows_left_out":48}
{"sheet":"Ennea Bass Padalka Calculation","index":15,"n_rows":69,"n_cols":7,"rows_kept":69,"cut":false,"hidden":false,"merged":[[68,3,68,4],[35,2,35,4],[62,2,62,4],[63,2,63,4],[64,2,64,4],[58,2,58,4],[59,1,59,2],[59,3,59,4],[60,2,60,4],[61,2,61,4],[47,1,47,4],[50,2,50,4],[51,1,51,4],[53,2,53,4],[55,2,55,4],[67,2,67,4],[13,1,13,4],[4,1,4,4],[5,3,5,4],[6,1,6,4],[10,2,10,4],[12,2,12,4],[18,1,18,4],[17,1,17,4],[44,2,44,4],[65,1,65,4],[66,2,66,4],[20,1,20,4],[27,2,27,4],[28,1,28,4],[31,2,31,4],[36,1,36,4],[39,2,39,4],[40,1,40,4],[57,2,57,4],[45,1,45,2],[46,2,46,4]]}
[]
[]
[]
[]
[null,"Specifications"]
["Part","Description","Choosen option","Cost"]
["General Specifications","General Specifications"]
["General Specifications","Model",{"$f":"IFERROR(INDEX('Superstrat Option List'!C2:C278,MATCH(#REF!&A8&B8,'Superstrat Option List'!#REF!&'Superstrat Option List'!A2:A278&'Superstrat Option List'!B2:B278,0)),\"Select Option\")","v":"Select Option"},{"$f":"INDEX('Ennea Bass Option list'!D2:D141,MATCH('Ennea Bass Padalka Calculation'!A8&'Ennea Bass Padalka Calculation'!B8&'Ennea Bass Padalka Calculation'!C8,'Ennea Bass Option list'!A2:A141&'Ennea Bass Option list'!B2:B141&'Ennea Bass Option list'!C2:C141,0))","v":0}]
["General Specifications","Number of Strings",{"$f":"IFERROR(INDEX('Superstrat Option List'!C3:C278,MATCH(#REF!&A9&B9,'Superstrat Option List'!#REF!&'Superstrat Option List'!A3:A278&'Superstrat Option List'!B3:B278,0)),\"Select Option\")","v":"Select Option"},{"$f":"INDEX('Ennea Bass Option list'!D3:D142,MATCH('Ennea Bass Padalka Calculation'!A9&'Ennea Bass Padalka Calculation'!B9&'Ennea Bass Padalka Calculation'!C9,'Ennea Bass Option list'!A3:A142&'Ennea Bass Option list'!B3:B142&'Ennea Bass Option list'!C3:C142,0))","v":0}]
["General Specifications","Scale Length",{"$f":"IFERROR(INDEX('Superstrat Option List'!C4:C278,MATCH(#REF!&A10&B10,'Superstrat Option List'!#REF!&'Superstrat Option List'!A4:A278&'Superstrat Option List'!B4:B278,0)),\"Select Option\")","v":"Select Option"},{"$f":"INDEX('Ennea Bass Option list'!D4:D143,MATCH('Ennea Bass Padalka Calculation'!A10&'Ennea Bass Padalka Calculation'!B10&'Ennea Bass Padalka Calculation'!C10,'Ennea Bass Option list'!A4:A143&'Ennea Bass Option list'!B4:B143&'Ennea Bass Option list'!C4:C143,0))","v":0}]
{"$rows_left_out":59}